BDBM50310967 3-((3-bromo-4-(2,4-difluorobenzyloxy)-6-methyl-2-oxopyridin-1(2H)-yl)methyl)-N,N-dimethylbenzamide::CHEMBL1078961
SMILES CN(C)C(=O)c1cccc(Cn2c(C)cc(OCc3ccc(F)cc3F)c(Br)c2=O)c1
InChI Key InChIKey=LSNZMLIZAVEKDI-UHFFFAOYSA-N
Data  2 IC50
  Tab Delimited (TSV)   2D SDfile   Computed 3D by Vconf -m prep SDfile
Find this compound or compounds like it in BindingDB:
Activity Spreadsheet -- Enzyme Inhibition Constant Data from BindingDB
Found 2 hits for monomerid = 50310967
TargetMitogen-activated protein kinase 9(Homo sapiens (Human))
Pfizer
Curated by ChEMBL
LigandPNGBDBM50310967(3-((3-bromo-4-(2,4-difluorobenzyloxy)-6-methyl-2-o...)
Affinity DataIC50: >2.00E+5nM. Assay description: Inhibition of JNK2
In DepthDetails ArticlePubMed
TargetMitogen-activated protein kinase 14(Homo sapiens (Human))
Pfizer
Curated by ChEMBL
LigandPNGBDBM50310967(3-((3-bromo-4-(2,4-difluorobenzyloxy)-6-methyl-2-o...)
Affinity DataIC50:  250nM. Assay description: Inhibition of p38alpha
In DepthDetails ArticlePubMed