BDBM50310977 3-bromo-4-(2,4-difluorobenzyloxy)-6-methyl-1-(5-methylpyrazin-2-yl)pyridin-2(1H)-one::CHEMBL1081677
SMILES Cc1cnc(cn1)-n1c(C)cc(OCc2ccc(F)cc2F)c(Br)c1=O
InChI Key InChIKey=UWWQNYRFLKCMOR-UHFFFAOYSA-N
Data  2 IC50
  Tab Delimited (TSV)   2D SDfile   Computed 3D by Vconf -m prep SDfile
Find this compound or compounds like it in BindingDB:
Activity Spreadsheet -- Enzyme Inhibition Constant Data from BindingDB
Found 2 hits for monomerid = 50310977
TargetMitogen-activated protein kinase 9(Homo sapiens (Human))
Pfizer
Curated by ChEMBL
LigandPNGBDBM50310977(3-bromo-4-(2,4-difluorobenzyloxy)-6-methyl-1-(5-me...)
Affinity DataIC50: >2.00E+5nM. Assay description: Inhibition of JNK2
In DepthDetails ArticlePubMed
TargetMitogen-activated protein kinase 14(Homo sapiens (Human))
Pfizer
Curated by ChEMBL
LigandPNGBDBM50310977(3-bromo-4-(2,4-difluorobenzyloxy)-6-methyl-1-(5-me...)
Affinity DataIC50:  450nM. Assay description: Inhibition of p38alpha
In DepthDetails ArticlePubMed