BDBM50311033 3-bromo-10-chloro-9H-benzo[f]imidazo[1,5-a][1,2,4]triazolo[1,5-d][1,4]diazepine::CHEMBL1078985
SMILES Clc1ncn-2c1Cn1ncnc1-c1cc(Br)ccc-21
InChI Key InChIKey=LLJUUCOIBTZXIJ-UHFFFAOYSA-N
Data  4 KI
  Tab Delimited (TSV)   2D SDfile   Computed 3D by Vconf -m prep SDfile
Find this compound or compounds like it in BindingDB:
Activity Spreadsheet -- Enzyme Inhibition Constant Data from BindingDB
Found 4 hits for monomerid = 50311033
TargetGABA-A receptor; alpha-5/beta-3/gamma-2(Homo sapiens (Human))
F. Hoffmann-La Roche
Curated by ChEMBL
LigandPNGBDBM50311033(3-bromo-10-chloro-9H-benzo[f]imidazo[1,5-a][1,2,4]...)
Affinity DataKi:  1.40nM. Assay description: Displacement of [3H]Flumazenil from cloned human GABAalpha5beta3gamma2 receptor expressed in HEK293 cells
In DepthDetails ArticlePubMed
TargetGamma-aminobutyric acid receptor subunit alpha-3/beta-3/gamma-2(Homo sapiens (Human))
F. Hoffmann-La Roche
Curated by ChEMBL
LigandPNGBDBM50311033(3-bromo-10-chloro-9H-benzo[f]imidazo[1,5-a][1,2,4]...)
Affinity DataKi:  8.80nM. Assay description: Displacement of [3H]Flumazenil from cloned human GABAalpha3beta3gamma2 receptor expressed in HEK293 cells
In DepthDetails ArticlePubMed
TargetGABA-A receptor; alpha-2/beta-3/gamma-2(Homo sapiens (Human))
F. Hoffmann-La Roche
Curated by ChEMBL
LigandPNGBDBM50311033(3-bromo-10-chloro-9H-benzo[f]imidazo[1,5-a][1,2,4]...)
Affinity DataKi:  24nM. Assay description: Displacement of [3H]Flumazenil from cloned human GABAalpha2beta3gamma2 receptor expressed in HEK293 cells
In DepthDetails ArticlePubMed
TargetGamma-aminobutyric acid receptor subunit alpha-1/beta-3/gamma-2(Homo sapiens (Human))
F. Hoffmann-La Roche
Curated by ChEMBL
LigandPNGBDBM50311033(3-bromo-10-chloro-9H-benzo[f]imidazo[1,5-a][1,2,4]...)
Affinity DataKi:  33nM. Assay description: Displacement of [3H]Flumazenil from cloned human GABAalpha1beta3gamma2 receptor expressed in HEK293 cells
In DepthDetails ArticlePubMed