BDBM50311037 10-chloro-3-cyclopropyl-9H-benzo[f]imidazo[1,5-a][1,2,4]triazolo[1,5-d][1,4]diazepine::CHEMBL1079090
SMILES Clc1ncn-2c1Cn1ncnc1-c1cc(ccc-21)C1CC1
InChI Key InChIKey=AETXHLUBKZXEAA-UHFFFAOYSA-N
Data  1 KI
  Tab Delimited (TSV)   2D SDfile   Computed 3D by Vconf -m prep SDfile
Find this compound or compounds like it in BindingDB:
Activity Spreadsheet -- Enzyme Inhibition Constant Data from BindingDB
Found 1 hit for monomerid = 50311037
TargetGABA-A receptor; alpha-5/beta-3/gamma-2(Homo sapiens (Human))
F. Hoffmann-La Roche
Curated by ChEMBL
LigandPNGBDBM50311037(10-chloro-3-cyclopropyl-9H-benzo[f]imidazo[1,5-a][...)
Affinity DataKi:  1.20nM. Assay description: Displacement of [3H]Flumazenil from cloned human GABAalpha5beta3gamma2 receptor expressed in HEK293 cells
In DepthDetails ArticlePubMed