BDBM50312926 (R)-4-(3-(isoquinolin-6-yl)-1,2,4-oxadiazol-5-yl)-1-(4-(trifluoromethyl)phenyl)butan-2-amine::CHEMBL1081118
SMILES N[C@H](CCc1nc(no1)-c1ccc2cnccc2c1)Cc1ccc(cc1)C(F)(F)F
InChI Key InChIKey=IHTIFKUCLCXNDN-LJQANCHMSA-N
Data  2 IC50
  Tab Delimited (TSV)   2D SDfile   Computed 3D by Vconf -m prep SDfile
Find this compound or compounds like it in BindingDB:
Activity Spreadsheet -- Enzyme Inhibition Constant Data from BindingDB
Found 2 hits for monomerid = 50312926
TargetCyclin-dependent kinase 2(Homo sapiens (Human))
Amgen
Curated by ChEMBL
LigandPNGBDBM50312926((R)-4-(3-(isoquinolin-6-yl)-1,2,4-oxadiazol-5-yl)-...)
Affinity DataIC50:  4.63E+3nM. Assay description: Inhibition of CDK2
In DepthDetails ArticlePubMed
TargetRAC-alpha serine/threonine-protein kinase(Homo sapiens (Human))
Amgen
Curated by ChEMBL
LigandPNGBDBM50312926((R)-4-(3-(isoquinolin-6-yl)-1,2,4-oxadiazol-5-yl)-...)
Affinity DataIC50:  1.60E+3nM. Assay description: Inhibition of human AKT1 in human U87MG cells assessed as PRAS40 phosphorylation after 1 hr by ELISA
In DepthDetails ArticlePubMed