BDBM50314876 CHEMBL4163814
SMILES [H][C@]12C[C@H](CCO)C=C[C@]1([C@H](\C=C(/Cl)c1ccc(cc1)C(=O)OCOC(C)=O)C=C(C)C2)C(=O)OCOC(C)=O
InChI Key InChIKey=PDKUDXCOBRKIOR-FJXZVBKQSA-N
Data  3 KI
  Tab Delimited (TSV)   2D SDfile   Computed 3D by Vconf -m prep SDfile
Find this compound or compounds like it in BindingDB:
Activity Spreadsheet -- Enzyme Inhibition Constant Data from BindingDB
Found 3 hits for monomerid = 50314876
TargetInduced myeloid leukemia cell differentiation protein Mcl-1 homolog(Mus musculus (Mouse))
Universit£
Curated by ChEMBL
LigandPNGBDBM50314876(CHEMBL4163814)
Affinity DataKi:  4.74E+3nM. Assay description: Inhibition of FITC-Ahx-Bid-OH binding to mouse DN150/DC25 Mcl-1 after 2 hrs by fluorescent polarization assay
In DepthDetails ArticlePubMed
TargetBcl-2-like protein 1(Homo sapiens (Human))
Universit£
Curated by ChEMBL
LigandPNGBDBM50314876(CHEMBL4163814)
Affinity DataKi: >2.30E+4nM. Assay description: Antagonism of carbachol action on nAChR of isolated frog rectus abdominus.
In DepthDetails ArticlePubMed
TargetApoptosis regulator Bcl-2(Homo sapiens (Human))
Universit£
Curated by ChEMBL
LigandPNGBDBM50314876(CHEMBL4163814)
Affinity DataKi: >2.30E+4nM. Assay description: Antagonism of carbachol action on nAChR of isolated frog rectus abdominus.
In DepthDetails ArticlePubMed