BDBM50315157 CHEMBL1092657::N-cyclohexyl-4-((6-(4-(propylsulfonyl)piperazin-1-yl)pyridin-3-yloxy)methyl)piperidine-1-carboxamide
SMILES CCCS(=O)(=O)N1CCN(CC1)c1ccc(OCC2CCN(CC2)C(=O)NC2CCCCC2)cn1
InChI Key InChIKey=UWZMWQPVUDFMAB-UHFFFAOYSA-N
Data  1 EC50
  Tab Delimited (TSV)   2D SDfile   Computed 3D by Vconf -m prep SDfile
Find this compound or compounds like it in BindingDB:
Activity Spreadsheet -- Enzyme Inhibition Constant Data from BindingDB
Found 1 hit for monomerid = 50315157
TargetGlucose-dependent insulinotropic receptor(Homo sapiens (Human))
Glaxosmithkline
Curated by ChEMBL
LigandPNGBDBM50315157(CHEMBL1092657 | N-cyclohexyl-4-((6-(4-(propylsulfo...)
Affinity DataEC50: >1.00E+4nM. Assay description: Agonist activity at human GPR119 receptor expressed in CHO-K1 cells cotransfected with 6CRE-Luc after 5 hrs by luciferase reporter gene assay
In DepthDetails ArticlePubMed