BDBM50315476 3-(1-(2,4-dichlorobenzyl)-3,3-difluoro-2-oxoindolin-7-yl)-N-(4-fluorophenylsulfonyl)acrylamide::CHEMBL1093239
SMILES Fc1ccc(cc1)S(=O)(=O)NC(=O)\C=C\c1cccc2c1N(Cc1ccc(Cl)cc1Cl)C(=O)C2(F)F
InChI Key InChIKey=WRWMRVMIRWYQQO-VZUCSPMQSA-N
Data  2 IC50
  Tab Delimited (TSV)   2D SDfile   Computed 3D by Vconf -m prep SDfile
Find this compound or compounds like it in BindingDB:
Activity Spreadsheet -- Enzyme Inhibition Constant Data from BindingDB
Found 2 hits for monomerid = 50315476
TargetProstaglandin E2 receptor EP3 subtype(Homo sapiens (Human))
Decode Chemistry
Curated by ChEMBL
LigandPNGBDBM50315476(3-(1-(2,4-dichlorobenzyl)-3,3-difluoro-2-oxoindoli...)
Affinity DataIC50:  64.7nM. Assay description: Displacement of [3H]PGE2 from human EP3 receptor in presence of 10% human serum
In DepthDetails ArticlePubMed
TargetProstaglandin E2 receptor EP3 subtype(Homo sapiens (Human))
Decode Chemistry
Curated by ChEMBL
LigandPNGBDBM50315476(3-(1-(2,4-dichlorobenzyl)-3,3-difluoro-2-oxoindoli...)
Affinity DataIC50:  0.200nM. Assay description: Displacement of [3H]PGE2 from human EP3 receptor in buffer
In DepthDetails ArticlePubMed