BDBM50315480 3-(3,3-difluoro-1-(naphthalen-2-ylmethyl)-2-oxoindolin-7-yl)-N-(3,4-difluorophenylsulfonyl)acrylamide::CHEMBL1093843
SMILES Fc1ccc(cc1F)S(=O)(=O)NC(=O)\C=C\c1cccc2c1N(Cc1ccc3ccccc3c1)C(=O)C2(F)F
InChI Key InChIKey=WSTIXFZMRLYBCK-JLHYYAGUSA-N
Data  2 IC50
  Tab Delimited (TSV)   2D SDfile   Computed 3D by Vconf -m prep SDfile
Find this compound or compounds like it in BindingDB:
Activity Spreadsheet -- Enzyme Inhibition Constant Data from BindingDB
Found 2 hits for monomerid = 50315480
TargetProstaglandin E2 receptor EP3 subtype(Homo sapiens (Human))
Decode Chemistry
Curated by ChEMBL
LigandPNGBDBM50315480(3-(3,3-difluoro-1-(naphthalen-2-ylmethyl)-2-oxoind...)
Affinity DataIC50:  5nM. Assay description: Displacement of [3H]PGE2 from human EP3 receptor in presence of 10% human serum
In DepthDetails ArticlePubMed
TargetProstaglandin E2 receptor EP3 subtype(Homo sapiens (Human))
Decode Chemistry
Curated by ChEMBL
LigandPNGBDBM50315480(3-(3,3-difluoro-1-(naphthalen-2-ylmethyl)-2-oxoind...)
Affinity DataIC50:  0.200nM. Assay description: Displacement of [3H]PGE2 from human EP3 receptor in buffer
In DepthDetails ArticlePubMed