BDBM50315481 CHEMBL1090222::N-(3,4-dichlorophenylsulfonyl)-3-(3,3-difluoro-1-(naphthalen-2-ylmethyl)-2-oxoindolin-7-yl)acrylamide
SMILES FC1(F)C(=O)N(Cc2ccc3ccccc3c2)c2c1cccc2\C=C\C(=O)NS(=O)(=O)c1ccc(Cl)c(Cl)c1
InChI Key InChIKey=FFMXUNLIUHLEMS-JLHYYAGUSA-N
Data  2 IC50
  Tab Delimited (TSV)   2D SDfile   Computed 3D by Vconf -m prep SDfile
Find this compound or compounds like it in BindingDB:
Activity Spreadsheet -- Enzyme Inhibition Constant Data from BindingDB
Found 2 hits for monomerid = 50315481
TargetProstaglandin E2 receptor EP3 subtype(Homo sapiens (Human))
Decode Chemistry
Curated by ChEMBL
LigandPNGBDBM50315481(CHEMBL1090222 | N-(3,4-dichlorophenylsulfonyl)-3-(...)
Affinity DataIC50:  4.5nM. Assay description: Displacement of [3H]PGE2 from human EP3 receptor in presence of 10% human serum
In DepthDetails ArticlePubMed
TargetProstaglandin E2 receptor EP3 subtype(Homo sapiens (Human))
Decode Chemistry
Curated by ChEMBL
LigandPNGBDBM50315481(CHEMBL1090222 | N-(3,4-dichlorophenylsulfonyl)-3-(...)
Affinity DataIC50:  0.300nM. Assay description: Displacement of [3H]PGE2 from human EP3 receptor in buffer
In DepthDetails ArticlePubMed