BDBM50315549 CHEMBL4175537
SMILES [H][C@]12C[C@H](CCN=[N+]=[N-])C=C[C@]1([C@H](\C=C(/Cl)c1ccc(cc1)C(=O)OCOC(C)=O)C=C(C)C2)C(=O)OCOC(C)=O
InChI Key InChIKey=DIACDDABYDEERE-FJXZVBKQSA-N
Data  3 KI
  Tab Delimited (TSV)   2D SDfile   Computed 3D by Vconf -m prep SDfile
Find this compound or compounds like it in BindingDB:
Activity Spreadsheet -- Enzyme Inhibition Constant Data from BindingDB
Found 3 hits for monomerid = 50315549
TargetApoptosis regulator Bcl-2(Homo sapiens (Human))
Universit£
Curated by ChEMBL
LigandPNGBDBM50315549(CHEMBL4175537)
Affinity DataKi:  1.45E+3nM. Assay description: Antagonism of carbachol action on nAChR of isolated frog rectus abdominus.
In DepthDetails ArticlePubMed
TargetInduced myeloid leukemia cell differentiation protein Mcl-1 homolog(Mus musculus (Mouse))
Universit£
Curated by ChEMBL
LigandPNGBDBM50315549(CHEMBL4175537)
Affinity DataKi:  2.25E+3nM. Assay description: Antagonism of carbachol action on nAChR of isolated frog rectus abdominus.
In DepthDetails ArticlePubMed
TargetBcl-2-like protein 1(Homo sapiens (Human))
Universit£
Curated by ChEMBL
LigandPNGBDBM50315549(CHEMBL4175537)
Affinity DataKi:  5.31E+3nM. Assay description: Antagonism of carbachol action on nAChR of isolated frog rectus abdominus.
In DepthDetails ArticlePubMed