BDBM50315661 2-(4-chloro-6-(3-chlorophenylamino)pyrimidin-2-ylthio)-2-(naphthalen-1-yl)acetic acid::CHEMBL1089467
SMILES OC(=O)C(Sc1nc(Cl)cc(Nc2cccc(Cl)c2)n1)c1cccc2ccccc12
InChI Key InChIKey=HVMQERGLUKDWRN-UHFFFAOYSA-N
Data  2 IC50  1 EC50
  Tab Delimited (TSV)   2D SDfile   Computed 3D by Vconf -m prep SDfile
Find this compound or compounds like it in BindingDB:
Activity Spreadsheet -- Enzyme Inhibition Constant Data from BindingDB
Found 3 hits for monomerid = 50315661
TargetPeroxisome proliferator-activated receptor gamma(Homo sapiens (Human))
Goethe-University Frankfurt
Curated by ChEMBL
LigandPNGBDBM50315661(2-(4-chloro-6-(3-chlorophenylamino)pyrimidin-2-ylt...)
Affinity DataEC50:  7.30E+3nM. Assay description: Transactivation of human PPARgamma LBD expressed in african green monkey Cos7 cells co-transfected with fused GAL4-DBD after 14 hrs by Dual-Glo Lucif...
In DepthDetails ArticlePubMed
TargetPolyunsaturated fatty acid 5-lipoxygenase(Homo sapiens (Human))
Goethe-University Frankfurt
Curated by ChEMBL
LigandPNGBDBM50315661(2-(4-chloro-6-(3-chlorophenylamino)pyrimidin-2-ylt...)
Affinity DataIC50:  5.00E+3nM. Assay description: Inhibition of human recombinant 5-lipoxygenase
In DepthDetails ArticlePubMed
TargetPolyunsaturated fatty acid 5-lipoxygenase(Homo sapiens (Human))
Goethe-University Frankfurt
Curated by ChEMBL
LigandPNGBDBM50315661(2-(4-chloro-6-(3-chlorophenylamino)pyrimidin-2-ylt...)
Affinity DataIC50:  700nM. Assay description: Inhibition of 5-lipoxygenase in human PMNL
In DepthDetails ArticlePubMed