BDBM50316254 CHEMBL1098245::methyl 4-(6-(4-(3-(4-(2-hydroxyethyl)phenyl)ureido)phenyl)-4-morpholino-1Hpyrazolo[3,4-d]pyrimidin-1-yl)piperidine-1-carboxylate
SMILES COC(=O)N1CCC(CC1)n1ncc2c(nc(nc12)-c1ccc(NC(=O)Nc2ccc(CCO)cc2)cc1)N1CCOCC1
InChI Key InChIKey=JYJRBELNIAMUFK-UHFFFAOYSA-N
Data  2 IC50
  Tab Delimited (TSV)   2D SDfile   Computed 3D by Vconf -m prep SDfile
Find this compound or compounds like it in BindingDB:
Activity Spreadsheet -- Enzyme Inhibition Constant Data from BindingDB
Found 2 hits for monomerid = 50316254
LigandPNGBDBM50316254(CHEMBL1098245 | methyl 4-(6-(4-(3-(4-(2-hydroxyeth...)
Affinity DataIC50:  10nM. Assay description: Inhibition of PI3Kalpha by DELFIA assay
In DepthDetails ArticlePubMed
TargetSerine/threonine-protein kinase mTOR(Homo sapiens (Human))
Wyeth Research
Curated by ChEMBL
LigandPNGBDBM50316254(CHEMBL1098245 | methyl 4-(6-(4-(3-(4-(2-hydroxyeth...)
Affinity DataIC50:  0.100nM. Assay description: Inhibition of human mTOR (1360-2549 amino acids) expressed in HEK293 cells
In DepthDetails ArticlePubMed