BDBM50316367 3-(2-Diethylamino-acetamino)-7,8-dehydrorutaecarpine::CHEMBL1096952
SMILES CCN(CC)CC(=O)Nc1ccc2nc3c4[nH]c5ccccc5c4ccn3c(=O)c2c1
InChI Key InChIKey=OXBFBPQXYBLXFZ-UHFFFAOYSA-N
Data  4 IC50
  Tab Delimited (TSV)   2D SDfile   Computed 3D by Vconf -m prep SDfile
Find this compound or compounds like it in BindingDB:
Activity Spreadsheet -- Enzyme Inhibition Constant Data from BindingDB
Found 4 hits for monomerid = 50316367
TargetAcetylcholinesterase(Electrophorus electricus (Electric eel))
Sun Yat-Sen University
Curated by ChEMBL
LigandPNGBDBM50316367(3-(2-Diethylamino-acetamino)-7,8-dehydrorutaecarpi...)
Affinity DataIC50:  57.1nM. Assay description: inhibition of electic eel AChE by Ellman's method
In DepthDetails ArticlePubMed
TargetAcetylcholinesterase(Electrophorus electricus (Electric eel))
Sun Yat-Sen University
Curated by ChEMBL
LigandPNGBDBM50316367(3-(2-Diethylamino-acetamino)-7,8-dehydrorutaecarpi...)
Affinity DataIC50:  70nM. Assay description: Inhibition of electric eel acetylcholinesterase using acetylthiocholine as substrate incubated for 15 mins followed by substrate addition measured fo...
In DepthDetails ArticlePubMed
TargetCholinesterase(Equus caballus (Horse))
Sun Yat-Sen University
Curated by ChEMBL
LigandPNGBDBM50316367(3-(2-Diethylamino-acetamino)-7,8-dehydrorutaecarpi...)
Affinity DataIC50:  2.41E+4nM. Assay description: Inhibition of horse serum butyrylcholinesterase using butylthiocholine as substrate incubated for 15 mins followed by substrate addition measured for...
In DepthDetails ArticlePubMed
TargetCholinesterase(Equus caballus (Horse))
Sun Yat-Sen University
Curated by ChEMBL
LigandPNGBDBM50316367(3-(2-Diethylamino-acetamino)-7,8-dehydrorutaecarpi...)
Affinity DataIC50:  1.14E+4nM. Assay description: inhibition of equine serum BuChE by Ellman's method
In DepthDetails ArticlePubMed