BDBM50317093 1-(1-{(2S)-3-[(6-Chloronaphthalen-2-yl)sulfonyl]-2-hydroxypropanoyl}piperidin-4-yl)azepan-2-one::CHEMBL1094240
SMILES O[C@H](CS(=O)(=O)c1ccc2cc(Cl)ccc2c1)C(=O)N1CCC(CC1)N1CCCCCC1=O
InChI Key InChIKey=COHCEVIBLCSAOK-JOCHJYFZSA-N
Data  1 IC50
  Tab Delimited (TSV)   2D SDfile   Computed 3D by Vconf -m prep SDfile
Find this compound or compounds like it in BindingDB:
Activity Spreadsheet -- Enzyme Inhibition Constant Data from BindingDB
Found 1 hit for monomerid = 50317093
TargetCoagulation factor X(Homo sapiens (Human))
Takeda Pharmaceutical
Curated by ChEMBL
LigandPNGBDBM50317093(1-(1-{(2S)-3-[(6-Chloronaphthalen-2-yl)sulfonyl]-2...)
Affinity DataIC50:  28nM. Assay description: Inhibition of human factor 10a assessed as p-nitroanilide release using S2765 as substrate by chromogenic assay
In DepthDetails ArticlePubMed