BDBM50317097 3-(1-{(2S)-3-[(6-Chloronaphthalen-2-yl)sulfonyl]-2-hydroxypropanoyl}piperidin-4-yl)-1,3-oxazinan-2-one::CHEMBL1095182
SMILES O[C@H](CS(=O)(=O)c1ccc2cc(Cl)ccc2c1)C(=O)N1CCC(CC1)N1CCCOC1=O
InChI Key InChIKey=QAJWUNCBHVDNKI-HXUWFJFHSA-N
Data  1 IC50
  Tab Delimited (TSV)   2D SDfile   Computed 3D by Vconf -m prep SDfile
Find this compound or compounds like it in BindingDB:
Activity Spreadsheet -- Enzyme Inhibition Constant Data from BindingDB
Found 1 hit for monomerid = 50317097
TargetCoagulation factor X(Homo sapiens (Human))
Takeda Pharmaceutical
Curated by ChEMBL
LigandPNGBDBM50317097(3-(1-{(2S)-3-[(6-Chloronaphthalen-2-yl)sulfonyl]-2...)
Affinity DataIC50:  20nM. Assay description: Inhibition of human factor 10a assessed as p-nitroanilide release using S2765 as substrate by chromogenic assay
In DepthDetails ArticlePubMed