BDBM50317445 7-benzyl-N-neopentyl-5-(piperidin-1-yl)-6,7,8,9-tetrahydro-3H-pyrazolo[3,4-c][2,7]naphthyridin-1-amine::CHEMBL1095529
SMILES CC(C)(C)CNc1n[nH]c2nc(N3CCCCC3)c3CN(Cc4ccccc4)CCc3c12
InChI Key InChIKey=DIAOPXQJRVGNLK-UHFFFAOYSA-N
Data  2 EC50
  Tab Delimited (TSV)   2D SDfile   Computed 3D by Vconf -m prep SDfile
Find this compound or compounds like it in BindingDB:
Activity Spreadsheet -- Enzyme Inhibition Constant Data from BindingDB
Found 2 hits for monomerid = 50317445
TargetBombesin receptor subtype-3(RAT)
Amri
Curated by ChEMBL
LigandPNGBDBM50317445(7-benzyl-N-neopentyl-5-(piperidin-1-yl)-6,7,8,9-te...)
Affinity DataEC50:  680nM. Assay description: Agonist activity at rat BRS3 expressed in HEK293AEQ cells after 10 mins by aequorin bioluminescence assay
In DepthDetails ArticlePubMed
TargetBombesin receptor subtype-3(Homo sapiens (Human))
Amri
Curated by ChEMBL
LigandPNGBDBM50317445(7-benzyl-N-neopentyl-5-(piperidin-1-yl)-6,7,8,9-te...)
Affinity DataEC50:  4.15E+3nM. Assay description: Agonist activity at human BRS3 expressed in HEK293AEQ cells after 10 mins by aequorin bioluminescence assay
In DepthDetails ArticlePubMed