BDBM50317468 CHEMBL4169558
SMILES OC(=O)CNC(=O)c1c(O)c2COCc2n(-c2ccc(cc2)C(F)(F)F)c1=O
InChI Key InChIKey=FXNHWVFHEPYDHZ-UHFFFAOYSA-N
Data  1 IC50
  Tab Delimited (TSV)   2D SDfile   Computed 3D by Vconf -m prep SDfile
Find this compound or compounds like it in BindingDB:
Activity Spreadsheet -- Enzyme Inhibition Constant Data from BindingDB
Found 1 hit for monomerid = 50317468
TargetEgl nine homolog 1(Homo sapiens (Human))
Cadila Healthcare
Curated by ChEMBL
LigandPNGBDBM50317468(CHEMBL4169558)
Affinity DataIC50:  5.80nM. Assay description: Inhibition of FLAG- tagged full length HIF-PHD2 (unknown origin) expressed in baculovirus-infected Sf9 cells using biotin labelled DLDLEMLAPYIPMDDDFQ...
In DepthDetails ArticlePubMed