BDBM50317472 7-benzyl-N5,N5-dimethyl-6,7,8,9-tetrahydro-3H-pyrazolo[3,4-c][2,7]naphthyridine-1,5-diamine::CHEMBL1094728
SMILES CN(C)c1nc2[nH]nc(N)c2c2CCN(Cc3ccccc3)Cc12
InChI Key InChIKey=UKKOSSBKCMUUMV-UHFFFAOYSA-N
Data  2 EC50
  Tab Delimited (TSV)   2D SDfile   Computed 3D by Vconf -m prep SDfile
Find this compound or compounds like it in BindingDB:
Activity Spreadsheet -- Enzyme Inhibition Constant Data from BindingDB
Found 2 hits for monomerid = 50317472
TargetBombesin receptor subtype-3(RAT)
Amri
Curated by ChEMBL
LigandPNGBDBM50317472(7-benzyl-N5,N5-dimethyl-6,7,8,9-tetrahydro-3H-pyra...)
Affinity DataEC50:  8.95E+3nM. Assay description: Agonist activity at rat BRS3 expressed in HEK293AEQ cells after 10 mins by aequorin bioluminescence assay
In DepthDetails ArticlePubMed
TargetBombesin receptor subtype-3(Homo sapiens (Human))
Amri
Curated by ChEMBL
LigandPNGBDBM50317472(7-benzyl-N5,N5-dimethyl-6,7,8,9-tetrahydro-3H-pyra...)
Affinity DataEC50:  1.00E+4nM. Assay description: Agonist activity at human BRS3 expressed in HEK293AEQ cells after 10 mins by aequorin bioluminescence assay
In DepthDetails ArticlePubMed