BDBM50317473 7-benzyl-5-(4-methylpiperazin-1-yl)-6,7,8,9-tetrahydro-3H-pyrazolo[3,4-c][2,7]naphthyridin-1-amine::CHEMBL1094727
SMILES CN1CCN(CC1)c1nc2[nH]nc(N)c2c2CCN(Cc3ccccc3)Cc12
InChI Key InChIKey=PZCBNEUZLXSSJZ-UHFFFAOYSA-N
Data  2 EC50
  Tab Delimited (TSV)   2D SDfile   Computed 3D by Vconf -m prep SDfile
Find this compound or compounds like it in BindingDB:
Activity Spreadsheet -- Enzyme Inhibition Constant Data from BindingDB
Found 2 hits for monomerid = 50317473
TargetBombesin receptor subtype-3(RAT)
Amri
Curated by ChEMBL
LigandPNGBDBM50317473(7-benzyl-5-(4-methylpiperazin-1-yl)-6,7,8,9-tetrah...)
Affinity DataEC50:  1.00E+4nM. Assay description: Agonist activity at rat BRS3 expressed in HEK293AEQ cells after 10 mins by aequorin bioluminescence assay
In DepthDetails ArticlePubMed
TargetBombesin receptor subtype-3(Homo sapiens (Human))
Amri
Curated by ChEMBL
LigandPNGBDBM50317473(7-benzyl-5-(4-methylpiperazin-1-yl)-6,7,8,9-tetrah...)
Affinity DataEC50:  1.00E+4nM. Assay description: Agonist activity at human BRS3 expressed in HEK293AEQ cells after 10 mins by aequorin bioluminescence assay
In DepthDetails ArticlePubMed