BDBM50317475 7-benzyl-5-morpholino-6,7,8,9-tetrahydro-3H-pyrazolo[3,4-c][2,7]naphthyridin-1-amine::CHEMBL1098098
SMILES Nc1n[nH]c2nc(N3CCOCC3)c3CN(Cc4ccccc4)CCc3c12
InChI Key InChIKey=FSFMFLKTKIVZGE-UHFFFAOYSA-N
Data  2 EC50
  Tab Delimited (TSV)   2D SDfile   Computed 3D by Vconf -m prep SDfile
Find this compound or compounds like it in BindingDB:
Activity Spreadsheet -- Enzyme Inhibition Constant Data from BindingDB
Found 2 hits for monomerid = 50317475
TargetBombesin receptor subtype-3(RAT)
Amri
Curated by ChEMBL
LigandPNGBDBM50317475(7-benzyl-5-morpholino-6,7,8,9-tetrahydro-3H-pyrazo...)
Affinity DataEC50:  3.56E+3nM. Assay description: Agonist activity at rat BRS3 expressed in HEK293AEQ cells after 10 mins by aequorin bioluminescence assay
In DepthDetails ArticlePubMed
TargetBombesin receptor subtype-3(Homo sapiens (Human))
Amri
Curated by ChEMBL
LigandPNGBDBM50317475(7-benzyl-5-morpholino-6,7,8,9-tetrahydro-3H-pyrazo...)
Affinity DataEC50:  1.00E+4nM. Assay description: Agonist activity at human BRS3 expressed in HEK293AEQ cells after 10 mins by aequorin bioluminescence assay
In DepthDetails ArticlePubMed