BDBM50317592 (-)-R-1-(1-(3-chlorophenyl)-2-(4-methylpiperazin-1-yl)ethyl)cyclohexanol::CHEMBL1099212
SMILES CN1CCN(C[C@@H](c2cccc(Cl)c2)C2(N)CCCCC2)CC1
InChI Key InChIKey=BHCVJMVHWIDLDP-SFHVURJKSA-N
Data  2 IC50
  Tab Delimited (TSV)   2D SDfile   Computed 3D by Vconf -m prep SDfile
Find this compound or compounds like it in BindingDB:
Activity Spreadsheet -- Enzyme Inhibition Constant Data from BindingDB
Found 2 hits for monomerid = 50317592
TargetSodium-dependent noradrenaline transporter(Homo sapiens (Human))
Wyeth Research
Curated by ChEMBL
LigandPNGBDBM50317592((-)-R-1-(1-(3-chlorophenyl)-2-(4-methylpiperazin-1...)
Affinity DataIC50:  576nM. Assay description: Inhibition of human NET transfected in MDCK-Net6 cells
In DepthDetails ArticlePubMed
TargetSodium-dependent dopamine transporter(Homo sapiens (Human))
Wyeth Research
Curated by ChEMBL
LigandPNGBDBM50317592((-)-R-1-(1-(3-chlorophenyl)-2-(4-methylpiperazin-1...)
Affinity DataIC50:  30nM. Assay description: Displacement of [3H]WIN-35428 form human DAT expressed in CHO cell membranes
In DepthDetails ArticlePubMed