BDBM50317594 1-(1-(2-chlorothiophen-3-yl)-2-(piperazin-1-yl)ethyl)cyclohexanol::CHEMBL1095524
SMILES OC1(CCCCC1)C(CN1CCNCC1)c1ccsc1Cl
InChI Key InChIKey=TVEJRNDJZBJGNP-UHFFFAOYSA-N
Data  1 IC50
  Tab Delimited (TSV)   2D SDfile   Computed 3D by Vconf -m prep SDfile
Find this compound or compounds like it in BindingDB:
Activity Spreadsheet -- Enzyme Inhibition Constant Data from BindingDB
Found 1 hit for monomerid = 50317594
TargetSodium-dependent noradrenaline transporter(Homo sapiens (Human))
Wyeth Research
Curated by ChEMBL
LigandPNGBDBM50317594(1-(1-(2-chlorothiophen-3-yl)-2-(piperazin-1-yl)eth...)
Affinity DataIC50:  720nM. Assay description: Inhibition of human NET transfected in MDCK-Net6 cells
In DepthDetails ArticlePubMed