BDBM50317933 (2R*,3S*,4R*,6S*)-2-(4-Bromophenyl)-6-((ethylthio)methyl)-tetrahydro-3,4-diphenyl-2H-pyran-4-ol)::CHEMBL1096725
SMILES CCSC[C@@H]1C[C@@](O)([C@H]([C@@H](O1)c1ccc(Br)cc1)c1ccccc1)c1ccccc1
InChI Key InChIKey=GJKDCSBFEHBUOJ-CQJMVLFOSA-N
Data  2 IC50
  Tab Delimited (TSV)   2D SDfile   Computed 3D by Vconf -m prep SDfile
Find this compound or compounds like it in BindingDB:
Activity Spreadsheet -- Enzyme Inhibition Constant Data from BindingDB
Found 2 hits for monomerid = 50317933
TargetProstaglandin G/H synthase 1(Ovis aries (Sheep))
Guru Nanak Dev University
Curated by ChEMBL
LigandPNGBDBM50317933((2R*,3S*,4R*,6S*)-2-(4-Bromophenyl)-6-((ethylthio)...)
Affinity DataIC50:  2.38E+4nM. Assay description: Inhibition of ovine COX1 assessed as inhibition of PGF2a formation after 20 mins by Ellman's method
In DepthDetails ArticlePubMed
TargetProstaglandin G/H synthase 2(Ovis aries (Sheep))
Guru Nanak Dev University
Curated by ChEMBL
LigandPNGBDBM50317933((2R*,3S*,4R*,6S*)-2-(4-Bromophenyl)-6-((ethylthio)...)
Affinity DataIC50:  2.80nM. Assay description: Inhibition of ovine COX2 assessed as inhibition of PGF2a formation after 20 mins by Ellman's method
In DepthDetails ArticlePubMed