BDBM50318146 5-(1,4-diazepan-1-yl)-3-ethyl-N-(pyrimidin-4-yl)-1-(2-(2,2,2-trifluoroethoxy)ethyl)-1H-pyrazolo[4,3-d]pyrimidin-7-amine::CHEMBL1095440
SMILES CCc1nn(CCOCC(F)(F)F)c2c(Nc3ccncn3)nc(nc12)N1CCCNCC1
InChI Key InChIKey=KBQCZXKHJACKAD-UHFFFAOYSA-N
Data  1 IC50
  Tab Delimited (TSV)   2D SDfile   Computed 3D by Vconf -m prep SDfile
Find this compound or compounds like it in BindingDB:
Activity Spreadsheet -- Enzyme Inhibition Constant Data from BindingDB
Found 1 hit for monomerid = 50318146
TargetcGMP-specific 3',5'-cyclic phosphodiesterase(Homo sapiens (Human))
Pfizer
Curated by ChEMBL
LigandPNGBDBM50318146(5-(1,4-diazepan-1-yl)-3-ethyl-N-(pyrimidin-4-yl)-1...)
Affinity DataIC50:  3.20nM. Assay description: Inhibition of PDE5
In DepthDetails ArticlePubMed