BDBM50318150 CHEMBL1097983::N5-(2-aminoethyl)-3-ethyl-N7-(pyrimidin-4-yl)-1-(2-(2,2,2-trifluoroethoxy)ethyl)-1H-pyrazolo[4,3-d]pyrimidine-5,7-diamine
SMILES CCc1nn(CCOCC(F)(F)F)c2c(Nc3ccncn3)nc(NCCN)nc12
InChI Key InChIKey=UEVIFNWBXVHDGP-UHFFFAOYSA-N
Data  1 IC50
  Tab Delimited (TSV)   2D SDfile   Computed 3D by Vconf -m prep SDfile
Find this compound or compounds like it in BindingDB:
Activity Spreadsheet -- Enzyme Inhibition Constant Data from BindingDB
Found 1 hit for monomerid = 50318150
TargetcGMP-specific 3',5'-cyclic phosphodiesterase(Homo sapiens (Human))
Pfizer
Curated by ChEMBL
LigandPNGBDBM50318150(CHEMBL1097983 | N5-(2-aminoethyl)-3-ethyl-N7-(pyri...)
Affinity DataIC50:  9.5nM. Assay description: Inhibition of PDE5
In DepthDetails ArticlePubMed