BDBM50318424 CHEMBL1098665::N-((S)-1-(3-cyanophenyl)-3-((3aR,6aS)-5-(4,6-dimethylpyrimidine-5-carbonyl)hexahydropyrrolo[3,4-c]pyrrol-2(1H)-yl)propyl)-2-(3,3-difluorocyclobutyl)acetamide
SMILES Cc1ncnc(C)c1C(=O)N1C[C@@H]2CN(CC[C@H](NC(=O)CC3CC(F)(F)C3)c3cccc(c3)C#N)C[C@@H]2C1
InChI Key InChIKey=JCILOYXTODENFR-GVAUOCQISA-N
Data  1 IC50
  Tab Delimited (TSV)   2D SDfile   Computed 3D by Vconf -m prep SDfile
Find this compound or compounds like it in BindingDB:
Activity Spreadsheet -- Enzyme Inhibition Constant Data from BindingDB
Found 1 hit for monomerid = 50318424
TargetC-C chemokine receptor type 5(Homo sapiens (Human))
Roche Palo Alto
Curated by ChEMBL
LigandPNGBDBM50318424(CHEMBL1098665 | N-((S)-1-(3-cyanophenyl)-3-((3aR,6...)
Affinity DataIC50:  34nM. Assay description: Binding affinity at CCR5 receptor by radiolabeled RANTES binding assay
In DepthDetails ArticlePubMed