BDBM50318425 2-(3,3-difluorocyclobutyl)-N-((S)-1-(3,5-difluorophenyl)-3-((3aR,6aS)-5-(4,6-dimethylpyrimidine-5-carbonyl)hexahydropyrrolo[3,4-c]pyrrol-2(1H)-yl)propyl)acetamide::CHEMBL1098664
SMILES Cc1ncnc(C)c1C(=O)N1C[C@@H]2CN(CC[C@H](NC(=O)CC3CC(F)(F)C3)c3cc(F)cc(F)c3)C[C@@H]2C1
InChI Key InChIKey=ZUSMCXAJFLVLLT-IMSXRSKXSA-N
Data  1 IC50
  Tab Delimited (TSV)   2D SDfile   Computed 3D by Vconf -m prep SDfile
Find this compound or compounds like it in BindingDB:
Activity Spreadsheet -- Enzyme Inhibition Constant Data from BindingDB
Found 1 hit for monomerid = 50318425
TargetC-C chemokine receptor type 5(Homo sapiens (Human))
Roche Palo Alto
Curated by ChEMBL
LigandPNGBDBM50318425(2-(3,3-difluorocyclobutyl)-N-((S)-1-(3,5-difluorop...)
Affinity DataIC50:  30nM. Assay description: Binding affinity at CCR5 receptor by radiolabeled RANTES binding assay
In DepthDetails ArticlePubMed