BDBM50318436 CHEMBL1097169::N-((S)-3-((3aR,6aS)-5-(2,4-dimethylnicotinoyl)hexahydropyrrolo[3,4-c]pyrrol-2(1H)-yl)-1-phenylpropyl)cyclopentanecarboxamide
SMILES Cc1ccnc(C)c1C(=O)N1C[C@@H]2CN(CC[C@H](NC(=O)C3CCCC3)c3ccccc3)C[C@@H]2C1
InChI Key InChIKey=IWRAPSCFSVGRAI-NXCFDTQHSA-N
Data  1 IC50
  Tab Delimited (TSV)   2D SDfile   Computed 3D by Vconf -m prep SDfile
Find this compound or compounds like it in BindingDB:
Activity Spreadsheet -- Enzyme Inhibition Constant Data from BindingDB
Found 1 hit for monomerid = 50318436
TargetC-C chemokine receptor type 5(Homo sapiens (Human))
Roche Palo Alto
Curated by ChEMBL
LigandPNGBDBM50318436(CHEMBL1097169 | N-((S)-3-((3aR,6aS)-5-(2,4-dimethy...)
Affinity DataIC50:  7nM. Assay description: Binding affinity at CCR5 receptor by radiolabeled RANTES binding assay
In DepthDetails ArticlePubMed