BDBM50318446 CHEMBL1096765::N-((S)-3-((3aR,6aS)-5-(2,6-dimethylbenzoyl)hexahydropyrrolo[3,4-c]pyrrol-2(1H)-yl)-1-phenylpropyl)-4,4-difluorocyclohexanecarboxamide
SMILES Cc1cccc(C)c1C(=O)N1C[C@@H]2CN(CC[C@H](NC(=O)C3CCC(F)(F)CC3)c3ccccc3)C[C@@H]2C1
InChI Key InChIKey=KIQJBZWNZGNCLV-VJGNERBWSA-N
Data  1 IC50
  Tab Delimited (TSV)   2D SDfile   Computed 3D by Vconf -m prep SDfile
Find this compound or compounds like it in BindingDB:
Activity Spreadsheet -- Enzyme Inhibition Constant Data from BindingDB
Found 1 hit for monomerid = 50318446
TargetC-C chemokine receptor type 5(Homo sapiens (Human))
Roche Palo Alto
Curated by ChEMBL
LigandPNGBDBM50318446(CHEMBL1096765 | N-((S)-3-((3aR,6aS)-5-(2,6-dimethy...)
Affinity DataIC50:  4nM. Assay description: Binding affinity at CCR5 receptor by radiolabeled RANTES binding assay
In DepthDetails ArticlePubMed