BDBM50318913 CHEMBL4177137
SMILES CN1Cc2c(CC1=O)c(O)c(C(=O)NCC(O)=O)c(=O)n2Cc1ccc(Cl)cc1
InChI Key InChIKey=YZRDGNKMUURJIG-UHFFFAOYSA-N
Data  1 IC50
  Tab Delimited (TSV)   2D SDfile   Computed 3D by Vconf -m prep SDfile
Find this compound or compounds like it in BindingDB:
Activity Spreadsheet -- Enzyme Inhibition Constant Data from BindingDB
Found 1 hit for monomerid = 50318913
TargetEgl nine homolog 1(Homo sapiens (Human))
Cadila Healthcare
Curated by ChEMBL
LigandPNGBDBM50318913(CHEMBL4177137)
Affinity DataIC50:  7.30nM. Assay description: Inhibition of FLAG- tagged full length HIF-PHD2 (unknown origin) expressed in baculovirus-infected Sf9 cells using biotin labelled DLDLEMLAPYIPMDDDFQ...
In DepthDetails ArticlePubMed