BDBM50320759 CHEMBL1164440::N-(2-Aminophenyl)-4-((N-(4-(thiophen-2-yl)benzyl)methylsulfonamido)methyl)benzamide
SMILES CS(=O)(=O)N(Cc1ccc(cc1)C(=O)Nc1ccccc1N)Cc1ccc(cc1)-c1cccs1
InChI Key InChIKey=VKIMWBWCMDPKTM-UHFFFAOYSA-N
Data  1 IC50
  Tab Delimited (TSV)   2D SDfile   Computed 3D by Vconf -m prep SDfile
Find this compound or compounds like it in BindingDB:
Activity Spreadsheet -- Enzyme Inhibition Constant Data from BindingDB
Found 1 hit for monomerid = 50320759
TargetHistone deacetylase 1(Homo sapiens (Human))
Kansai University
Curated by ChEMBL
LigandPNGBDBM50320759(CHEMBL1164440 | N-(2-Aminophenyl)-4-((N-(4-(thioph...)
Affinity DataIC50:  1.20E+3nM. Assay description: Inhibition of HDAC1
In DepthDetails ArticlePubMed