BDBM50320808 CHEMBL1164988::N-{4-[3-(beta-Alanylamino)phenyl]-6-(5-chloro-2-hydroxyphenyl)-3-cyanopyridin-2-yl}thiophene-2-carboxamide
SMILES NCCC(=O)Nc1cccc(c1)-c1cc(nc(NC(=O)c2cccs2)c1C#N)-c1cc(Cl)ccc1O
InChI Key InChIKey=DTJMNATYCITOOF-UHFFFAOYSA-N
Data  1 IC50
  Tab Delimited (TSV)   2D SDfile   Computed 3D by Vconf -m prep SDfile
Find this compound or compounds like it in BindingDB:
Activity Spreadsheet -- Enzyme Inhibition Constant Data from BindingDB
Found 1 hit for monomerid = 50320808
TargetKiSS-1 receptor(Homo sapiens (Human))
Takeda Pharmaceutical
Curated by ChEMBL
LigandPNGBDBM50320808(CHEMBL1164988 | N-{4-[3-(beta-Alanylamino)phenyl]-...)
Affinity DataIC50:  490nM. Assay description: Displacement of [125I]metastin(40-54) from human GPR54 receptor expressed in CHO cells after 60 mins by scintillation counting
In DepthDetails ArticlePubMed