BDBM50320831 CHEMBL1165468::Ethyl 5-(7-(3-(diethylamino)propoxy)-6-methoxyquinazolin-4-ylamino)benzo[b]thiophene-2-carboxylate
SMILES CCOC(=O)c1cc2cc(Nc3ncnc4cc(OCCCN(CC)CC)c(OC)cc34)ccc2s1
InChI Key InChIKey=KHQLZJIASNWTGK-UHFFFAOYSA-N
Data  1 IC50
  Tab Delimited (TSV)   2D SDfile   Computed 3D by Vconf -m prep SDfile
Find this compound or compounds like it in BindingDB:
Activity Spreadsheet -- Enzyme Inhibition Constant Data from BindingDB
Found 1 hit for monomerid = 50320831
TargetReceptor tyrosine-protein kinase erbB-2(Homo sapiens (Human))
Southeast University
Curated by ChEMBL
LigandPNGBDBM50320831(CHEMBL1165468 | Ethyl 5-(7-(3-(diethylamino)propox...)
Affinity DataIC50:  2.29E+3nM. Assay description: Inhibition of HER2
In DepthDetails ArticlePubMed