BDBM50320847 CHEMBL1163318
SMILES NC(=O)CNC(=O)[C@@H]1C[C@@H](O)CN1C(=O)[C@@H]1CCCN1C(=O)CNC(=O)[C@@H]1C[C@@H](O)CN1C(=O)[C@@H]1CCCN1C(=O)CNC(=O)[C@@H]1C[C@@H](O)CN1C(=O)[C@@H]1CCCN1C(=O)CNC(=O)[C@@H]1C[C@@H](O)CN1C(=O)[C@@H]1CCCN1C(=O)CNC(=O)[C@H](CCCNC(N)=N)NC(=O)[C@@H]1CCCN1C(=O)CNC(=O)[C@@H]1CCN1C(=O)[C@@H]1CCCN1C(=O)CNC(=O)[C@@H]1C[C@@H](O)CN1C(=O)[C@@H]1CCCN1C(=O)CNC(=O)[C@@H]1C[C@@H](O)CN1C(=O)[C@@H]1CCCN1C(=O)CNC(=O)[C@@H]1C[C@@H](O)CN1C(=O)[C@@H]1CCCN1
InChI Key InChIKey=AOLPOGSRGJIYIE-RMPHBCRMSA-N
Data  1 IC50
  Tab Delimited (TSV)   2D SDfile   Computed 3D by Vconf -m prep SDfile
Find this compound or compounds like it in BindingDB:
Activity Spreadsheet -- Enzyme Inhibition Constant Data from BindingDB
Found 1 hit for monomerid = 50320847
TargetSerpin H1(Mus musculus)
Waseda University
Curated by ChEMBL
LigandPNGBDBM50320847(CHEMBL1163318)
Affinity DataIC50:  4.20E+3nM. Assay description: Binding affinity to mouse recombinant HSP47 expressed in Escherichia coli JM109 after 10 mins by surface plasmon resonance assay
In DepthDetails ArticlePubMed