BDBM50320851 CHEMBL1163314
SMILES CC(C)(O)[C@H](NC(=O)[C@@H]1CCCN1C(=O)CNC(=O)[C@@H]1C[C@@H](O)CN1C(=O)[C@@H]1CCCN1C(=O)CNC(=O)[C@@H]1C[C@@H](O)CN1C(=O)[C@@H]1CCCN1C(=O)CNC(=O)[C@@H]1C[C@@H](O)CN1C(=O)[C@@H]1CCCN1)C(=O)NCC(=O)N1CCC[C@H]1C(=O)N[C@@H](CCCNC(N)=N)C(=O)NCC(=O)N1CCC[C@H]1C(=O)N1C[C@H](O)C[C@H]1C(=O)NCC(=O)N1CCC[C@H]1C(=O)N1C[C@H](O)C[C@H]1C(=O)NCC(=O)N1CCC[C@H]1C(=O)N1C[C@H](O)C[C@H]1C(=O)NCC(=O)N1CCC[C@H]1C(=O)N1C[C@H](O)C[C@H]1C(=O)NCC(N)=O
InChI Key InChIKey=ZGDGSECJFYOEPU-RGEJPJQLSA-N
Data  1 IC50
  Tab Delimited (TSV)   2D SDfile   Computed 3D by Vconf -m prep SDfile
Find this compound or compounds like it in BindingDB:
Activity Spreadsheet -- Enzyme Inhibition Constant Data from BindingDB
Found 1 hit for monomerid = 50320851
TargetSerpin H1(Mus musculus)
Waseda University
Curated by ChEMBL
LigandPNGBDBM50320851(CHEMBL1163314)
Affinity DataIC50:  9.10E+3nM. Assay description: Binding affinity to mouse recombinant HSP47 expressed in Escherichia coli JM109 after 10 mins by surface plasmon resonance assay
In DepthDetails ArticlePubMed