BDBM50321034 CHEMBL1165054::ent-16alpha-Hydroxykaur-11-en-18-oic acid
SMILES C[C@]1(O)C[C@@]23C[C@H]1C=C[C@@H]2[C@@]1(C)CCC[C@](C)([C@@H]1CC3)C(O)=O
InChI Key InChIKey=PBADTGZBFPSKOQ-QKLHCSQXSA-N
Data  1 IC50
  Tab Delimited (TSV)   2D SDfile   Computed 3D by Vconf -m prep SDfile
Find this compound or compounds like it in BindingDB:
Activity Spreadsheet -- Enzyme Inhibition Constant Data from BindingDB
Found 1 hit for monomerid = 50321034
TargetBcl-2-like protein 1(Homo sapiens (Human))
Centre De Recherche De Gif
Curated by ChEMBL
LigandPNGBDBM50321034(CHEMBL1165054 | ent-16alpha-Hydroxykaur-11-en-18-o...)
Affinity DataIC50:  3.80E+5nM. Assay description: Displacement of fluorescently-tagged BH3 peptide from Bcl-XL by fluorimetric assay
In DepthDetails ArticlePubMed