BDBM50321076 CHEMBL1163775::N-Butyloxycarbonyl-3-[4-(3-methyl-2-oxoimidazolidin-1-yl-methyl)-phenyl]-5-iso-butylthiophene-2-sulfonamide
SMILES CCCCOC(=O)NS(=O)(=O)c1sc(CC(C)C)cc1-c1ccc(CN2CCN(C)C2=O)cc1
InChI Key InChIKey=RKRDUKYCQKZKPQ-UHFFFAOYSA-N
Data  1 KI
  Tab Delimited (TSV)   2D SDfile   Computed 3D by Vconf -m prep SDfile
Find this compound or compounds like it in BindingDB:
Activity Spreadsheet -- Enzyme Inhibition Constant Data from BindingDB
Found 1 hit for monomerid = 50321076
TargetType-2 angiotensin II receptor(Sus scrofa)
Uppsala University
Curated by ChEMBL
LigandPNGBDBM50321076(CHEMBL1163775 | N-Butyloxycarbonyl-3-[4-(3-methyl-...)
Affinity DataKi:  16.5nM. Assay description: Displacement of [125I]angiotensin 2 from AT2 receptor in pig uterus membrane after 1.5 hrs by gamma counting
In DepthDetails ArticlePubMed