BDBM50321118 3-({(1E)-[4-(Dimethylamino)phenyl]methylene}amino)-2-phenylquinazolin-4(3H)-one::CHEMBL1163745
SMILES CN(C)c1ccc(\C=N\N2C(Nc3ccccc3C2=O)c2ccccc2)cc1
InChI Key InChIKey=MMFKGZDUQXTJEY-LFVJCYFKSA-N
Data  1 KI  1 IC50
  Tab Delimited (TSV)   2D SDfile   Computed 3D by Vconf -m prep SDfile
Find this compound or compounds like it in BindingDB:
Activity Spreadsheet -- Enzyme Inhibition Constant Data from BindingDB
Found 2 hits for monomerid = 50321118
TargetThermolysin(Bacillus thermoproteolyticus)
University Of Troms£
Curated by ChEMBL
LigandPNGBDBM50321118(3-({(1E)-[4-(Dimethylamino)phenyl]methylene}amino)...)
Affinity DataKi:  4.20E+4nM. Assay description: Inhibition of Bacillus thermoproteolyticus thermolysin after 15 mins by microplate fluorescence analysis in presence of 0.5 to 2 mM substrate FaGLa
In DepthDetails ArticlePubMed
TargetThermolysin(Bacillus thermoproteolyticus)
University Of Troms£
Curated by ChEMBL
LigandPNGBDBM50321118(3-({(1E)-[4-(Dimethylamino)phenyl]methylene}amino)...)
Affinity DataIC50:  4.20E+4nM. Assay description: Inhibition of Bacillus thermoproteolyticus thermolysin after 15 mins by microplate fluorescence analysis in presence of 0.1 M substrate FaGLa
In DepthDetails ArticlePubMed