BDBM50321282 Alpneumine D::CHEMBL1163799
SMILES COC(=O)C1[C@@H]2C[C@H]3N(CC[C@@]33C1=Nc1c3cccc1O)C[C@H]2C(C)=O
InChI Key InChIKey=DJUDIVFQOFPQBS-LXWLGDICSA-N
Data  1 IC50
  Tab Delimited (TSV)   2D SDfile   Computed 3D by Vconf -m prep SDfile
Find this compound or compounds like it in BindingDB:
Activity Spreadsheet -- Enzyme Inhibition Constant Data from BindingDB
Found 1 hit for monomerid = 50321282
TargetPolyphenol oxidase 2(Agaricus bisporus (Common mushroom))
Hoshi University
Curated by ChEMBL
LigandPNGBDBM50321282(Alpneumine D | CHEMBL1163799)
Affinity DataIC50: >1.00E+5nM. Assay description: Inhibition of mushroom tyrosinase
In DepthDetails ArticlePubMed