BDBM50321654 3-(1H-pyrazol-3-yl)-6-(1H-pyrazol-4-yl)imidazo[1,2-a]pyrimidine::CHEMBL1171534
SMILES c1cc(n[nH]1)-c1cnc2ncc(cn12)-c1cn[nH]c1
InChI Key InChIKey=MQGHHLZJAHJXPY-UHFFFAOYSA-N
Data  2 IC50
  Tab Delimited (TSV)   2D SDfile   Computed 3D by Vconf -m prep SDfile
Find this compound or compounds like it in BindingDB:
Activity Spreadsheet -- Enzyme Inhibition Constant Data from BindingDB
Found 2 hits for monomerid = 50321654
TargetSerine/threonine-protein kinase Chk2(Homo sapiens (Human))
The Institute Of Cancer Research
Curated by ChEMBL
LigandPNGBDBM50321654(3-(1H-pyrazol-3-yl)-6-(1H-pyrazol-4-yl)imidazo[1,2...)
Affinity DataIC50:  480nM. Assay description: Inhibition of CHK2 by DELFIA assay
In DepthDetails ArticlePubMed
TargetSerine/threonine-protein kinase Chk1(Homo sapiens (Human))
The Institute Of Cancer Research
Curated by ChEMBL
LigandPNGBDBM50321654(3-(1H-pyrazol-3-yl)-6-(1H-pyrazol-4-yl)imidazo[1,2...)
Affinity DataIC50:  1.50E+3nM. Assay description: Inhibition of CHK1 by DELFIA
In DepthDetails ArticlePubMed