BDBM50322602 CHEMBL1172743::alpha-Sulfanyl(4-fluorobenzyl)phosphonic acid
SMILES OP(O)(O)C(=S)c1ccc(F)cc1
InChI Key InChIKey=DTMYTDPTMHBBFW-UHFFFAOYSA-N
Data  3 KI
  Tab Delimited (TSV)   2D SDfile   Computed 3D by Vconf -m prep SDfile
Find this compound or compounds like it in BindingDB:
Activity Spreadsheet -- Enzyme Inhibition Constant Data from BindingDB
Found 3 hits for monomerid = 50322602
TargetMetallo-beta-lactamase type 2(Aeromonas hydrophila)
University Of Li£Ge
Curated by ChEMBL
LigandPNGBDBM50322602(CHEMBL1172743 | alpha-Sulfanyl(4-fluorobenzyl)phos...)
Affinity DataKi:  1.00E+3nM. Assay description: Inhibition of Aeromonas hydrophila cphA
In DepthDetails ArticlePubMed
TargetMetallo-beta-lactamase L1 type 3(Stenotrophomonas maltophilia)
University Of Li£Ge
Curated by ChEMBL
LigandPNGBDBM50322602(CHEMBL1172743 | alpha-Sulfanyl(4-fluorobenzyl)phos...)
Affinity DataKi:  1.80E+4nM. Assay description: Inhibition of Stenotrophomonas maltophilia beta lactamase L1 in presence of Zn+ chelator
In DepthDetails ArticlePubMed
TargetMetallo-beta-lactamase L1 type 3(Stenotrophomonas maltophilia)
University Of Li£Ge
Curated by ChEMBL
LigandPNGBDBM50322602(CHEMBL1172743 | alpha-Sulfanyl(4-fluorobenzyl)phos...)
Affinity DataKi: >2.00E+4nM. Assay description: Inhibition of Stenotrophomonas maltophilia beta lactamase L1 in absence of Zn+ chelator
In DepthDetails ArticlePubMed