BDBM50322784 4'-(2-methyl-1-(pyridin-4-yl)prop-1-enyl)biphenyl-3-amine::CHEMBL1173326
SMILES [#6]\[#6](-[#6])=[#6](/c1ccncc1)-c1ccc(cc1)-c1cccc(-[#7])c1
InChI Key InChIKey=ZBBONVVBPSZXJW-UHFFFAOYSA-N
Data  5 IC50
  Tab Delimited (TSV)   2D SDfile   Computed 3D by Vconf -m prep SDfile
Find this compound or compounds like it in BindingDB:
Activity Spreadsheet -- Enzyme Inhibition Constant Data from BindingDB
Found 5 hits for monomerid = 50322784
TargetSteroid 17-alpha-hydroxylase/17,20 lyase(Homo sapiens (Human))
Saarland University
Curated by ChEMBL
LigandPNGBDBM50322784(4'-(2-methyl-1-(pyridin-4-yl)prop-1-enyl)biphenyl-...)
Affinity DataIC50:  38nM. Assay description: Inhibition of human CYP17 expressed in Escherichia coli coexpressing NADPH-P450 reductase
In DepthDetails ArticlePubMed
TargetCytochrome P450 11B1, mitochondrial(Homo sapiens (Human))
Saarland University
Curated by ChEMBL
LigandPNGBDBM50322784(4'-(2-methyl-1-(pyridin-4-yl)prop-1-enyl)biphenyl-...)
Affinity DataIC50:  7.30E+3nM. Assay description: Inhibition of human CYP11B1 expressed in hamster V79MZh cells
In DepthDetails ArticlePubMed
TargetCytochrome P450 3A4(Homo sapiens (Human))
Saarland University
Curated by ChEMBL
LigandPNGBDBM50322784(4'-(2-methyl-1-(pyridin-4-yl)prop-1-enyl)biphenyl-...)
Affinity DataIC50:  1.33E+3nM. Assay description: Inhibition of CYP3A4 expressed in baculovirus infected insect microsomes
In DepthDetails ArticlePubMed
TargetAromatase(Homo sapiens (Human))
Saarland University
Curated by ChEMBL
LigandPNGBDBM50322784(4'-(2-methyl-1-(pyridin-4-yl)prop-1-enyl)biphenyl-...)
Affinity DataIC50:  5.06E+3nM. Assay description: Inhibition of CYP19 in human placental microsomes
In DepthDetails ArticlePubMed
TargetCytochrome P450 11B2, mitochondrial(Homo sapiens (Human))
Saarland University
Curated by ChEMBL
LigandPNGBDBM50322784(4'-(2-methyl-1-(pyridin-4-yl)prop-1-enyl)biphenyl-...)
Affinity DataIC50:  3.83E+3nM. Assay description: Inhibition of human CYP11B2 expressed in hamster V79MZh cells
In DepthDetails ArticlePubMed