BDBM50322787 6-(4-(2-methyl-1-(pyridin-4-yl)prop-1-enyl)phenyl)naphthalen-2-ol::CHEMBL1172842
SMILES [#6]\[#6](-[#6])=[#6](/c1ccncc1)-c1ccc(cc1)-c1ccc2cc(-[#8])ccc2c1
InChI Key InChIKey=CNWICPKRBQBLMF-UHFFFAOYSA-N
Data  4 IC50
  Tab Delimited (TSV)   2D SDfile   Computed 3D by Vconf -m prep SDfile
Find this compound or compounds like it in BindingDB:
Activity Spreadsheet -- Enzyme Inhibition Constant Data from BindingDB
Found 4 hits for monomerid = 50322787
TargetSteroid 17-alpha-hydroxylase/17,20 lyase(Homo sapiens (Human))
Saarland University
Curated by ChEMBL
LigandPNGBDBM50322787(6-(4-(2-methyl-1-(pyridin-4-yl)prop-1-enyl)phenyl)...)
Affinity DataIC50:  62nM. Assay description: Inhibition of human CYP17 expressed in Escherichia coli coexpressing NADPH-P450 reductase
In DepthDetails ArticlePubMed
TargetAromatase(Homo sapiens (Human))
Saarland University
Curated by ChEMBL
LigandPNGBDBM50322787(6-(4-(2-methyl-1-(pyridin-4-yl)prop-1-enyl)phenyl)...)
Affinity DataIC50:  4.87E+4nM. Assay description: Inhibition of CYP19 in human placental microsomes
In DepthDetails ArticlePubMed
TargetCytochrome P450 11B2, mitochondrial(Homo sapiens (Human))
Saarland University
Curated by ChEMBL
LigandPNGBDBM50322787(6-(4-(2-methyl-1-(pyridin-4-yl)prop-1-enyl)phenyl)...)
Affinity DataIC50:  4.95E+4nM. Assay description: Inhibition of human CYP11B2 expressed in hamster V79MZh cells
In DepthDetails ArticlePubMed
TargetCytochrome P450 11B1, mitochondrial(Homo sapiens (Human))
Saarland University
Curated by ChEMBL
LigandPNGBDBM50322787(6-(4-(2-methyl-1-(pyridin-4-yl)prop-1-enyl)phenyl)...)
Affinity DataIC50:  5.06E+3nM. Assay description: Inhibition of human CYP11B1 expressed in hamster V79MZh cells
In DepthDetails ArticlePubMed