BDBM50322798 CHEMBL1173726::tert-butyl 4'-(2-methyl-1-(pyridin-4-yl)prop-1-enyl)biphenyl-3-ylcarbamate
SMILES [#6]\[#6](-[#6])=[#6](/c1ccncc1)-c1ccc(cc1)-c1cccc(-[#7]-[#6](=O)-[#8]C([#6])([#6])[#6])c1
InChI Key InChIKey=VFRVUIXCPWWWII-UHFFFAOYSA-N
Data  1 IC50
  Tab Delimited (TSV)   2D SDfile   Computed 3D by Vconf -m prep SDfile
Find this compound or compounds like it in BindingDB:
Activity Spreadsheet -- Enzyme Inhibition Constant Data from BindingDB
Found 1 hit for monomerid = 50322798
TargetSteroid 17-alpha-hydroxylase/17,20 lyase(Homo sapiens (Human))
Saarland University
Curated by ChEMBL
LigandPNGBDBM50322798(CHEMBL1173726 | tert-butyl 4'-(2-methyl-1-(pyridin...)
Affinity DataIC50:  1.46E+3nM. Assay description: Inhibition of human CYP17 expressed in Escherichia coli coexpressing NADPH-P450 reductase
In DepthDetails ArticlePubMed