BDBM50323151 CHEMBL1209252::N-(2-(4-((3S,4R)-1-tert-butyl-4-(2,4-difluorophenyl)pyrrolidine-3-carbonyl)piperazin-1-yl)-2-cyclohexylethyl)-N-isopropyl acetamide::N-(2-(4-((3S,4R)-1-tert-butyl-4-(2,4-difluorophenyl)pyrrolidine-3-carbonyl)piperazin-1-yl)-2-cyclohexylethyl)-N-isopropylacetamide
SMILES CC(C)N(CC(C1CCCCC1)N1CCN(CC1)C(=O)[C@@H]1CN(C[C@H]1c1ccc(F)cc1F)C(C)(C)C)C(C)=O
InChI Key InChIKey=HQPISMGZXLHBTG-VXLAJHQFSA-N
Data  5 IC50  4 EC50
  Tab Delimited (TSV)   2D SDfile   Computed 3D by Vconf -m prep SDfile
Find this compound or compounds like it in BindingDB:
Activity Spreadsheet -- Enzyme Inhibition Constant Data from BindingDB
Found 9 hits for monomerid = 50323151
TargetMelanocortin receptor 3(Homo sapiens (Human))
Merck Research Laboratories
Curated by ChEMBL
LigandPNGBDBM50323151(CHEMBL1209252 | N-(2-(4-((3S,4R)-1-tert-butyl-4-(2...)
Affinity DataEC50:  2.00E+3nM. Assay description: Agonist activity at human MC3 receptor expressed in CHO cells assessed as increase of alpha-MSH-induced cAMP accumulation
In DepthDetails ArticlePubMed
TargetMelanocortin receptor 3(Homo sapiens (Human))
Merck Research Laboratories
Curated by ChEMBL
LigandPNGBDBM50323151(CHEMBL1209252 | N-(2-(4-((3S,4R)-1-tert-butyl-4-(2...)
Affinity DataIC50:  6.50E+3nM. Assay description: Displacement of [125I]NDP-alpha-MSH from human MC3 receptor expressed in CHO cells
In DepthDetails ArticlePubMed
TargetMelanocyte-stimulating hormone receptor(Homo sapiens (Human))
Merck Research Laboratories
Curated by ChEMBL
LigandPNGBDBM50323151(CHEMBL1209252 | N-(2-(4-((3S,4R)-1-tert-butyl-4-(2...)
Affinity DataIC50:  1.80E+3nM. Assay description: Displacement of [125I]NDP-alpha-MSH from human MC1 receptor expressed in CHO cells
In DepthDetails ArticlePubMed
TargetMelanocortin receptor 5(Homo sapiens (Human))
Merck Research Laboratories
Curated by ChEMBL
LigandPNGBDBM50323151(CHEMBL1209252 | N-(2-(4-((3S,4R)-1-tert-butyl-4-(2...)
Affinity DataIC50:  660nM. Assay description: Displacement of [125I]NDP-alpha-MSH from human MC5 receptor expressed in CHO cells
In DepthDetails ArticlePubMed
TargetMelanocortin receptor 5(Homo sapiens (Human))
Merck Research Laboratories
Curated by ChEMBL
LigandPNGBDBM50323151(CHEMBL1209252 | N-(2-(4-((3S,4R)-1-tert-butyl-4-(2...)
Affinity DataEC50:  2.80E+3nM. Assay description: Agonist activity at human MC5 receptor expressed in CHO cells assessed as increase of alpha-MSH-induced cAMP accumulation
In DepthDetails ArticlePubMed
TargetMelanocortin receptor 4(Homo sapiens (Human))
Merck Research Laboratories
Curated by ChEMBL
LigandPNGBDBM50323151(CHEMBL1209252 | N-(2-(4-((3S,4R)-1-tert-butyl-4-(2...)
Affinity DataEC50:  25nM. Assay description: Agonist activity at human MC4 receptor expressed in CHO cells assessed as increase of alpha-MSH-induced cAMP accumulation
In DepthDetails ArticlePubMed
TargetMelanocortin receptor 4(Homo sapiens (Human))
Merck Research Laboratories
Curated by ChEMBL
LigandPNGBDBM50323151(CHEMBL1209252 | N-(2-(4-((3S,4R)-1-tert-butyl-4-(2...)
Affinity DataIC50:  29nM. Assay description: Agonist activity at human MC4 receptor expressed in CHO cells assessed as increase of alpha-MSH-induced cAMP accumulation
In DepthDetails ArticlePubMed
TargetMelanocyte-stimulating hormone receptor(Homo sapiens (Human))
Merck Research Laboratories
Curated by ChEMBL
LigandPNGBDBM50323151(CHEMBL1209252 | N-(2-(4-((3S,4R)-1-tert-butyl-4-(2...)
Affinity DataEC50:  890nM. Assay description: Agonist activity at human MC1 receptor expressed in CHO cells assessed as increase of alpha-MSH-induced cAMP accumulation
In DepthDetails ArticlePubMed
TargetMelanocortin receptor 4(Homo sapiens (Human))
Merck Research Laboratories
Curated by ChEMBL
LigandPNGBDBM50323151(CHEMBL1209252 | N-(2-(4-((3S,4R)-1-tert-butyl-4-(2...)
Affinity DataIC50:  29nM. Assay description: Displacement of [125I]NDP-alpha-MSH from human MC4 receptor expressed in CHO cells
In DepthDetails ArticlePubMed