BDBM50323384 1,2-dicyclohexyl-3-(3,4-dihydroisoquinolin-2(1H)-yl)propan-1-one O-phenylcarbamoyl oxime::CHEMBL1209270
SMILES O=C(Nc1ccccc1)O\N=C(\C(CN1CCc2ccccc2C1)C1CCCCC1)C1CCCCC1
InChI Key InChIKey=NLODKTVSVGPPGJ-KKYHWDRJSA-N
Data  1 KI
  Tab Delimited (TSV)   2D SDfile   Computed 3D by Vconf -m prep SDfile
Find this compound or compounds like it in BindingDB:
Activity Spreadsheet -- Enzyme Inhibition Constant Data from BindingDB
Found 1 hit for monomerid = 50323384
TargetMetabotropic glutamate receptor 5(Rattus norvegicus (Rat))
Gedeon Richter
Curated by ChEMBL
LigandPNGBDBM50323384(1,2-dicyclohexyl-3-(3,4-dihydroisoquinolin-2(1H)-y...)
Affinity DataKi: >1.00E+3nM. Assay description: Antagonist activity at mGLUR5 in rat E17 cells assessed as calcium accumulation by fluorimetry
In DepthDetails ArticlePubMed