BDBM50323387 1,2-dicyclohexyl-3-(pyridin-4-yl)propan-1-one O-3-chlorophenylcarbamoyl oxime::CHEMBL1209339
SMILES Clc1cccc(NC(=O)O\N=C(\C(Cc2ccncc2)C2CCCCC2)C2CCCCC2)c1
InChI Key InChIKey=VPMATNJKSOVSRN-GKPLWNPISA-N
Data  1 KI
  Tab Delimited (TSV)   2D SDfile   Computed 3D by Vconf -m prep SDfile
Find this compound or compounds like it in BindingDB:
Activity Spreadsheet -- Enzyme Inhibition Constant Data from BindingDB
Found 1 hit for monomerid = 50323387
TargetMetabotropic glutamate receptor 5(Rattus norvegicus (Rat))
Gedeon Richter
Curated by ChEMBL
LigandPNGBDBM50323387(1,2-dicyclohexyl-3-(pyridin-4-yl)propan-1-one O-3-...)
Affinity DataKi:  117nM. Assay description: Antagonist activity at mGLUR5 in rat E17 cells assessed as calcium accumulation by fluorimetry
In DepthDetails ArticlePubMed