BDBM50323785 9,9'-(4,4'-(1,1'-(3,6,9,12,15,18,21-heptaoxatricosane-1,23-diyl)bis(1H-1,2,3-triazole-4,1-diyl))bis(butane-4,1-diyl))bis(8-(6-bromobenzo[d][1,3]dioxol-5-ylthio)-9H-purin-6-amine)::CHEMBL1213897
SMILES Nc1ncnc2n(CCCCc3cn(CCOCCOCCOCCOCCOCCOCCOCCn4cc(CCCCn5c(Sc6cc7OCOc7cc6Br)nc6c(N)ncnc56)nn4)nn3)c(Sc3cc4OCOc4cc3Br)nc12
InChI Key InChIKey=QTERIFISQCKAJB-UHFFFAOYSA-N
Data  1 IC50
  Tab Delimited (TSV)   2D SDfile   Computed 3D by Vconf -m prep SDfile
Find this compound or compounds like it in BindingDB:
Activity Spreadsheet -- Enzyme Inhibition Constant Data from BindingDB
Found 1 hit for monomerid = 50323785
TargetHeat shock protein HSP 90-alpha(Homo sapiens (Human))
Hokkaido University
Curated by ChEMBL
LigandPNGBDBM50323785(9,9'-(4,4'-(1,1'-(3,6,9,12,15,18,21-heptaoxatricos...)
Affinity DataIC50:  3.10E+3nM. Assay description: Displacement of biotin-labeled geldanamycin from N-terminal His-tagged human recombinant HSP90alpha expressed in Escherichia coli
In DepthDetails ArticlePubMed