BDBM50324056 2-Amino-6-dimethylamino-4-phenylpyridine-3,5-dicarbonitrile::CHEMBL1214957
SMILES CN(C)c1nc(N)c(C#N)c(-c2ccccc2)c1C#N
InChI Key InChIKey=VRSXWMVVYDRJLI-UHFFFAOYSA-N
Data  2 IC50
  Tab Delimited (TSV)   2D SDfile   Computed 3D by Vconf -m prep SDfile
Find this compound or compounds like it in BindingDB:
Activity Spreadsheet -- Enzyme Inhibition Constant Data from BindingDB
Found 2 hits for monomerid = 50324056
TargetCarboxylic ester hydrolase(Equus caballus (Horse))
Laboratorio De Radicales Libres Y QuíMica Computacional (Iqog, Csic)
Curated by ChEMBL
LigandPNGBDBM50324056(2-Amino-6-dimethylamino-4-phenylpyridine-3,5-dicar...)
Affinity DataIC50: >1.00E+5nM. Assay description: Inhibition of equine serum BuChE after 10 mins by Ellman's method
In DepthDetails ArticlePubMed
TargetAcetylcholinesterase(Electrophorus electricus (Electric eel))
Laboratorio De Radicales Libres Y QuíMica Computacional (Iqog, Csic)
Curated by ChEMBL
LigandPNGBDBM50324056(2-Amino-6-dimethylamino-4-phenylpyridine-3,5-dicar...)
Affinity DataIC50: >1.00E+5nM. Assay description: Inhibition of Electrophorus electricus AChE after 10 mins by Ellman's method
In DepthDetails ArticlePubMed